{"text_format":"1","workbook":"xlsx","n_sheets":7,"sheets":["ホーム","管理者用シート","業務日報(新宿店)","業務日報","勤怠管理出勤","勤怠管理退勤","勤怠日報管理"],"not_rendered":{"charts":0,"images":0,"macros":1,"external_links":0,"defined_names":0,"comments":0,"pivot_tables":0},"unopened":[],"bounds":{"document_bytes":16777216,"sheet_cells":100000,"rows_first":2000,"rows_last":500,"rows_between":2000,"halvings":0,"cell_chars":16384,"cell_head_chars":4096},"cells_cut":0,"cells_raw":0,"read":"whole","date_system":"1900"}

{"sheet":"ホーム","index":0,"n_rows":0,"n_cols":0,"rows_kept":0,"cut":false,"hidden":false,"merged":[]}

{"sheet":"管理者用シート","index":1,"n_rows":9,"n_cols":5,"rows_kept":9,"cut":false,"hidden":false,"merged":[]}
["id","pass","氏名","かな","所属店舗"]
["Shinjuku0001A","abc0001","新宿 一夫","しんじゅく かずお","新宿店"]
["Shibuya0002B","abc0002","渋谷 二郎","しぶや じろう","渋谷店"]
["Ikebukuro0003C","abc0003","池袋 修三","いけぶくろ しゅうぞう","池袋店"]
["Ebisu0004D","abc0004","恵比寿 花子","えびす はなこ","恵比寿店"]
["Ueno0005E","abc0005","上野 道子","うえの みちこ","上野店"]
["Akihabara0006F","abc0006","秋葉原 麻利絵","あきはばら まりえ","秋葉原店"]
[1,2,1,1,1]
["Roppongi0007G","abc0007","六本木 恵理子","ろっぽんぎ えりこ","六本木店"]

{"sheet":"業務日報(新宿店)","index":2,"n_rows":2,"n_cols":4,"rows_kept":2,"cut":false,"hidden":true,"merged":[]}
["氏名","所属店","日付","報告内容"]
["a","新宿店","2021-02-12","qqqq"]

{"sheet":"業務日報","index":3,"n_rows":203,"n_cols":5,"rows_kept":203,"cut":false,"hidden":false,"merged":[]}
["自動入力","自動入力","自動入力","自動入力","数式コピー"]
["氏名","所属店","日付","報告内容","キー"]
["新宿 一夫","新宿店","2021-02-13","aaa",{"$f":"IFERROR(TEXT(C3,\"m月d日\")&A3,\"\")","v":"2月13日新宿 一夫"}]
["新宿 一夫","新宿店","2021-02-14","今日は業務管理システムについて勉強しました。",{"$f":"IFERROR(TEXT(C4,\"m月d日\")&A4,\"\")","v":"2月14日新宿 一夫"}]
["六本木 恵理子","六本木店","2021-02-14","新規IDとPWの登録が完了しました。","2月14日六本木 恵理子"]
["渋谷 二郎","渋谷店","2021-02-14","こちらはテスト入力です。","2月14日渋谷 二郎"]
["新宿 一夫","新宿店","2021-02-14","これはデモンストレーションです。","2月14日新宿 一夫"]
[null,null,null,null,"1月0日"]
[null,null,null,null,"1月0日"]
[null,null,null,null,"1月0日"]
[null,null,null,null,"1月0日"]
[null,null,null,null,"1月0日"]
[null,null,null,null,"1月0日"]
[null,null,null,null,"1月0日"]
[null,null,null,null,"1月0日"]
[null,null,null,null,"1月0日"]
[null,null,null,null,"1月0日"]
[null,null,null,null,"1月0日"]
[null,null,null,null,"1月0日"]
[null,null,null,null,"1月0日"]
[null,null,null,null,"1月0日"]
[null,null,null,null,"1月0日"]
[null,null,null,null,"1月0日"]
[null,null,null,null,"1月0日"]
[null,null,null,null,"1月0日"]
[null,null,null,null,"1月0日"]
[null,null,null,null,"1月0日"]
[null,null,null,null,"1月0日"]
[null,null,null,null,"1月0日"]
[null,null,null,null,"1月0日"]
[null,null,null,null,"1月0日"]
[null,null,null,null,"1月0日"]
[null,null,null,null,"1月0日"]
[null,null,null,null,"1月0日"]
[null,null,null,null,"1月0日"]
[null,null,null,null,"1月0日"]
[null,null,null,null,"1月0日"]
[null,null,null,null,"1月0日"]
[null,null,null,null,"1月0日"]
[null,null,null,null,"1月0日"]
{"$rows_left_out":164}
{"sheet":"勤怠管理出勤","index":4,"n_rows":203,"n_cols":6,"rows_kept":203,"cut":false,"hidden":false,"merged":[]}
["自動入力","自動入力","自動入力","数式コピー","数式コピー","数式コピー"]
["氏名","所属店","日時","日付","キー","出勤時間"]
["新宿 一夫","新宿店","2021-02-13T02:50:10",{"$f":"IFERROR(TEXT(C3,\"m月d日\"),\"\")","v":"2月13日"},{"$f":"IFERROR(D3&A3,\"\")","v":"2月13日新宿 一夫"},{"$f":"IFERROR(TEXT(C3,\"hh:mm\"),0)","v":"02:50"}]
["新宿 一夫","新宿店","2021-02-14T17:11:31",{"$f":"IFERROR(TEXT(C4,\"m月d日\"),\"\")","v":"2月14日"},{"$f":"IFERROR(D4&A4,\"\")","v":"2月14日新宿 一夫"},{"$f":"IFERROR(TEXT(C4,\"hh:mm\"),0)","v":"17:11"}]
["渋谷 二郎","渋谷店","2021-02-14T17:58:59","2月14日","2月14日渋谷 二郎","17:58"]
["新宿 一夫","新宿店","2021-02-14T18:26:23","2月14日","2月14日新宿 一夫","18:26"]
[null,null,null,"1月0日","1月0日","00:00"]
[null,null,null,"1月0日","1月0日","00:00"]
[null,null,null,"1月0日","1月0日","00:00"]
[null,null,null,"1月0日","1月0日","00:00"]
[null,null,null,"1月0日","1月0日","00:00"]
[null,null,null,"1月0日","1月0日","00:00"]
[null,null,null,"1月0日","1月0日","00:00"]
[null,null,null,"1月0日","1月0日","00:00"]
[null,null,null,"1月0日","1月0日","00:00"]
[null,null,null,"1月0日","1月0日","00:00"]
[null,null,null,"1月0日","1月0日","00:00"]
[null,null,null,"1月0日","1月0日","00:00"]
[null,null,null,"1月0日","1月0日","00:00"]
[null,null,null,"1月0日","1月0日","00:00"]
[null,null,null,"1月0日","1月0日","00:00"]
[null,null,null,"1月0日","1月0日","00:00"]
[null,null,null,"1月0日","1月0日","00:00"]
[null,null,null,"1月0日","1月0日","00:00"]
[null,null,null,"1月0日","1月0日","00:00"]
[null,null,null,"1月0日","1月0日","00:00"]
[null,null,null,"1月0日","1月0日","00:00"]
[null,null,null,"1月0日","1月0日","00:00"]
[null,null,null,"1月0日","1月0日","00:00"]
[null,null,null,"1月0日","1月0日","00:00"]
[null,null,null,"1月0日","1月0日","00:00"]
[null,null,null,"1月0日","1月0日","00:00"]
[null,null,null,"1月0日","1月0日","00:00"]
[null,null,null,"1月0日","1月0日","00:00"]
[null,null,null,"1月0日","1月0日","00:00"]
[null,null,null,"1月0日","1月0日","00:00"]
[null,null,null,"1月0日","1月0日","00:00"]
[null,null,null,"1月0日","1月0日","00:00"]
[null,null,null,"1月0日","1月0日","00:00"]
[null,null,null,"1月0日","1月0日","00:00"]
{"$rows_left_out":164}
{"sheet":"勤怠管理退勤","index":5,"n_rows":203,"n_cols":6,"rows_kept":203,"cut":false,"hidden":false,"merged":[]}
["自動入力","自動入力","自動入力","数式コピー","数式コピー","数式コピー"]
["氏名","所属店","日付","日付","キー","退勤時間"]
["新宿 一夫","新宿店","2021-02-13T22:07:25",{"$f":"IFERROR(TEXT(C3,\"m月d日\"),\"\")","v":"2月13日"},{"$f":"IFERROR(D3&A3,\"\")","v":"2月13日新宿 一夫"},{"$f":"IFERROR(TEXT(C3,\"hh:mm\"),\"\")","v":"22:07"}]
["新宿 一夫","新宿店","2021-02-14T17:13:41",{"$f":"IFERROR(TEXT(C4,\"m月d日\"),\"\")","v":"2月14日"},{"$f":"IFERROR(D4&A4,\"\")","v":"2月14日新宿 一夫"},{"$f":"IFERROR(TEXT(C4,\"hh:mm\"),\"\")","v":"17:13"}]
[null,null,null,"1月0日","1月0日","00:00"]
[null,null,null,"1月0日","1月0日","00:00"]
[null,null,null,"1月0日","1月0日","00:00"]
[null,null,null,"1月0日","1月0日","00:00"]
[null,null,null,"1月0日","1月0日","00:00"]
[null,null,null,"1月0日","1月0日","00:00"]
[null,null,null,"1月0日","1月0日","00:00"]
[null,null,null,"1月0日","1月0日","00:00"]
[null,null,null,"1月0日","1月0日","00:00"]
[null,null,null,"1月0日","1月0日","00:00"]
[null,null,null,"1月0日","1月0日","00:00"]
[null,null,null,"1月0日","1月0日","00:00"]
[null,null,null,"1月0日","1月0日","00:00"]
[null,null,null,"1月0日","1月0日","00:00"]
[null,null,null,"1月0日","1月0日","00:00"]
[null,null,null,"1月0日","1月0日","00:00"]
[null,null,null,"1月0日","1月0日","00:00"]
[null,null,null,"1月0日","1月0日","00:00"]
[null,null,null,"1月0日","1月0日","00:00"]
[null,null,null,"1月0日","1月0日","00:00"]
[null,null,null,"1月0日","1月0日","00:00"]
[null,null,null,"1月0日","1月0日","00:00"]
[null,null,null,"1月0日","1月0日","00:00"]
[null,null,null,"1月0日","1月0日","00:00"]
[null,null,null,"1月0日","1月0日","00:00"]
[null,null,null,"1月0日","1月0日","00:00"]
[null,null,null,"1月0日","1月0日","00:00"]
[null,null,null,"1月0日","1月0日","00:00"]
[null,null,null,"1月0日","1月0日","00:00"]
[null,null,null,"1月0日","1月0日","00:00"]
[null,null,null,"1月0日","1月0日","00:00"]
[null,null,null,"1月0日","1月0日","00:00"]
[null,null,null,"1月0日","1月0日","00:00"]
[null,null,null,"1月0日","1月0日","00:00"]
[null,null,null,"1月0日","1月0日","00:00"]
[null,null,null,"1月0日","1月0日","00:00"]
{"$rows_left_out":164}
{"sheet":"勤怠日報管理","index":6,"n_rows":203,"n_cols":7,"rows_kept":203,"cut":false,"hidden":false,"merged":[]}
["手入力","数式コピー","リストから選択","数式コピー","数式コピー","数式コピー","数式コピー"]
["日付","日付(加工用)","氏名","所属店","出勤時間","退勤時間","報告内容"]
["2021-02-13",{"$f":"TEXT(A3,\"m月d日\")","v":"2月13日"},"新宿 一夫",{"$f":"IFERROR(VLOOKUP($C3,OFFSET(管理者用シート!$C$2,0,0,COUNTA(管理者用シート!E:E)-1,3),3,FALSE),\"\")","v":"新宿店"},{"$f":"IFERROR(VLOOKUP(B3&C3,OFFSET(勤怠管理出勤!$E$3,0,0,COUNTA(勤怠管理出勤!F:F)-1,2),2,FALSE),\"\")","v":"02:50"},{"$f":"IFERROR(VLOOKUP(B3&C3,OFFSET(勤怠管理退勤!$E$3,0,0,COUNTA(勤怠管理退勤!F:F)-1,2),2,FALSE),\"\")","v":"22:07"},{"$f":"IFERROR(INDEX(OFFSET(業務日報!$D$3,0,0,COUNTA(業務日報!D:D)-2,1),MATCH(勤怠日報管理!B3&勤怠日報管理!C3,OFFSET(業務日報!$E$3,0,0,COUNTA(業務日報!E:E)-2,1),0)),\"\")","v":"aaa"}]
["2021-02-14",{"$f":"TEXT(A4,\"m月d日\")","v":"2月14日"},"新宿 一夫",{"$f":"IFERROR(VLOOKUP($C4,OFFSET(管理者用シート!$C$2,0,0,COUNTA(管理者用シート!E:E)-1,3),3,FALSE),\"\")","v":"新宿店"},{"$f":"IFERROR(VLOOKUP(B4&C4,OFFSET(勤怠管理出勤!$E$3,0,0,COUNTA(勤怠管理出勤!F:F)-1,2),2,FALSE),\"\")","v":"17:11"},{"$f":"IFERROR(VLOOKUP(B4&C4,OFFSET(勤怠管理退勤!$E$3,0,0,COUNTA(勤怠管理退勤!F:F)-1,2),2,FALSE),\"\")","v":"17:13"},{"$f":"IFERROR(INDEX(OFFSET(業務日報!$D$3,0,0,COUNTA(業務日報!D:D)-2,1),MATCH(勤怠日報管理!B4&勤怠日報管理!C4,OFFSET(業務日報!$E$3,0,0,COUNTA(業務日報!E:E)-2,1),0)),\"\")","v":"今日は業務管理システムについて勉強しました。"}]
["2021-02-14",{"$f":"TEXT(A5,\"m月d日\")","v":"2月14日"},"六本木 恵理子",{"$f":"IFERROR(VLOOKUP($C5,OFFSET(管理者用シート!$C$2,0,0,COUNTA(管理者用シート!E:E)-1,3),3,FALSE),\"\")","v":"六本木店"},{"$f":"IFERROR(VLOOKUP(B5&C5,OFFSET(勤怠管理出勤!$E$3,0,0,COUNTA(勤怠管理出勤!F:F)-1,2),2,FALSE),\"\")","v":""},{"$f":"IFERROR(VLOOKUP(B5&C5,OFFSET(勤怠管理退勤!$E$3,0,0,COUNTA(勤怠管理退勤!F:F)-1,2),2,FALSE),\"\")","v":""},{"$f":"IFERROR(INDEX(OFFSET(業務日報!$D$3,0,0,COUNTA(業務日報!D:D)-2,1),MATCH(勤怠日報管理!B5&勤怠日報管理!C5,OFFSET(業務日報!$E$3,0,0,COUNTA(業務日報!E:E)-2,1),0)),\"\")","v":"新規IDとPWの登録が完了しました。"}]
["2021-02-14","2月14日","渋谷 二郎",{"$f":"IFERROR(VLOOKUP($C6,OFFSET(管理者用シート!$C$2,0,0,COUNTA(管理者用シート!E:E)-1,3),3,FALSE),\"\")","v":"渋谷店"},{"$f":"IFERROR(VLOOKUP(B6&C6,OFFSET(勤怠管理出勤!$E$3,0,0,COUNTA(勤怠管理出勤!F:F)-1,2),2,FALSE),\"\")","v":"17:58"},{"$f":"IFERROR(VLOOKUP(B6&C6,OFFSET(勤怠管理退勤!$E$3,0,0,COUNTA(勤怠管理退勤!F:F)-1,2),2,FALSE),\"\")","v":""},{"$f":"IFERROR(INDEX(OFFSET(業務日報!$D$3,0,0,COUNTA(業務日報!D:D)-2,1),MATCH(勤怠日報管理!B6&勤怠日報管理!C6,OFFSET(業務日報!$E$3,0,0,COUNTA(業務日報!E:E)-2,1),0)),\"\")","v":"こちらはテスト入力です。"}]
[null,"1月0日",null,{"$f":"IFERROR(VLOOKUP($C7,OFFSET(管理者用シート!$C$2,0,0,COUNTA(管理者用シート!E:E)-1,3),3,FALSE),\"\")","v":""},{"$f":"IFERROR(VLOOKUP(B7&C7,OFFSET(勤怠管理出勤!$E$3,0,0,COUNTA(勤怠管理出勤!F:F)-1,2),2,FALSE),\"\")","v":"00:00"},{"$f":"IFERROR(VLOOKUP(B7&C7,OFFSET(勤怠管理退勤!$E$3,0,0,COUNTA(勤怠管理退勤!F:F)-1,2),2,FALSE),\"\")","v":"00:00"},{"$f":"IFERROR(INDEX(OFFSET(業務日報!$D$3,0,0,COUNTA(業務日報!D:D)-2,1),MATCH(勤怠日報管理!B7&勤怠日報管理!C7,OFFSET(業務日報!$E$3,0,0,COUNTA(業務日報!E:E)-2,1),0)),\"\")","v":""}]
[null,"1月0日",null,{"$f":"IFERROR(VLOOKUP($C8,OFFSET(管理者用シート!$C$2,0,0,COUNTA(管理者用シート!E:E)-1,3),3,FALSE),\"\")","v":""},{"$f":"IFERROR(VLOOKUP(B8&C8,OFFSET(勤怠管理出勤!$E$3,0,0,COUNTA(勤怠管理出勤!F:F)-1,2),2,FALSE),\"\")","v":"00:00"},{"$f":"IFERROR(VLOOKUP(B8&C8,OFFSET(勤怠管理退勤!$E$3,0,0,COUNTA(勤怠管理退勤!F:F)-1,2),2,FALSE),\"\")","v":"00:00"},{"$f":"IFERROR(INDEX(OFFSET(業務日報!$D$3,0,0,COUNTA(業務日報!D:D)-2,1),MATCH(勤怠日報管理!B8&勤怠日報管理!C8,OFFSET(業務日報!$E$3,0,0,COUNTA(業務日報!E:E)-2,1),0)),\"\")","v":""}]
[null,"1月0日",null,{"$f":"IFERROR(VLOOKUP($C9,OFFSET(管理者用シート!$C$2,0,0,COUNTA(管理者用シート!E:E)-1,3),3,FALSE),\"\")","v":""},{"$f":"IFERROR(VLOOKUP(B9&C9,OFFSET(勤怠管理出勤!$E$3,0,0,COUNTA(勤怠管理出勤!F:F)-1,2),2,FALSE),\"\")","v":"00:00"},{"$f":"IFERROR(VLOOKUP(B9&C9,OFFSET(勤怠管理退勤!$E$3,0,0,COUNTA(勤怠管理退勤!F:F)-1,2),2,FALSE),\"\")","v":"00:00"},{"$f":"IFERROR(INDEX(OFFSET(業務日報!$D$3,0,0,COUNTA(業務日報!D:D)-2,1),MATCH(勤怠日報管理!B9&勤怠日報管理!C9,OFFSET(業務日報!$E$3,0,0,COUNTA(業務日報!E:E)-2,1),0)),\"\")","v":""}]
[null,"1月0日",null,{"$f":"IFERROR(VLOOKUP($C10,OFFSET(管理者用シート!$C$2,0,0,COUNTA(管理者用シート!E:E)-1,3),3,FALSE),\"\")","v":""},{"$f":"IFERROR(VLOOKUP(B10&C10,OFFSET(勤怠管理出勤!$E$3,0,0,COUNTA(勤怠管理出勤!F:F)-1,2),2,FALSE),\"\")","v":"00:00"},{"$f":"IFERROR(VLOOKUP(B10&C10,OFFSET(勤怠管理退勤!$E$3,0,0,COUNTA(勤怠管理退勤!F:F)-1,2),2,FALSE),\"\")","v":"00:00"},{"$f":"IFERROR(INDEX(OFFSET(業務日報!$D$3,0,0,COUNTA(業務日報!D:D)-2,1),MATCH(勤怠日報管理!B10&勤怠日報管理!C10,OFFSET(業務日報!$E$3,0,0,COUNTA(業務日報!E:E)-2,1),0)),\"\")","v":""}]
[null,"1月0日",null,{"$f":"IFERROR(VLOOKUP($C11,OFFSET(管理者用シート!$C$2,0,0,COUNTA(管理者用シート!E:E)-1,3),3,FALSE),\"\")","v":""},{"$f":"IFERROR(VLOOKUP(B11&C11,OFFSET(勤怠管理出勤!$E$3,0,0,COUNTA(勤怠管理出勤!F:F)-1,2),2,FALSE),\"\")","v":"00:00"},{"$f":"IFERROR(VLOOKUP(B11&C11,OFFSET(勤怠管理退勤!$E$3,0,0,COUNTA(勤怠管理退勤!F:F)-1,2),2,FALSE),\"\")","v":"00:00"},{"$f":"IFERROR(INDEX(OFFSET(業務日報!$D$3,0,0,COUNTA(業務日報!D:D)-2,1),MATCH(勤怠日報管理!B11&勤怠日報管理!C11,OFFSET(業務日報!$E$3,0,0,COUNTA(業務日報!E:E)-2,1),0)),\"\")","v":""}]
[null,"1月0日",null,{"$f":"IFERROR(VLOOKUP($C12,OFFSET(管理者用シート!$C$2,0,0,COUNTA(管理者用シート!E:E)-1,3),3,FALSE),\"\")","v":""},{"$f":"IFERROR(VLOOKUP(B12&C12,OFFSET(勤怠管理出勤!$E$3,0,0,COUNTA(勤怠管理出勤!F:F)-1,2),2,FALSE),\"\")","v":"00:00"},{"$f":"IFERROR(VLOOKUP(B12&C12,OFFSET(勤怠管理退勤!$E$3,0,0,COUNTA(勤怠管理退勤!F:F)-1,2),2,FALSE),\"\")","v":"00:00"},{"$f":"IFERROR(INDEX(OFFSET(業務日報!$D$3,0,0,COUNTA(業務日報!D:D)-2,1),MATCH(勤怠日報管理!B12&勤怠日報管理!C12,OFFSET(業務日報!$E$3,0,0,COUNTA(業務日報!E:E)-2,1),0)),\"\")","v":""}]
[null,"1月0日",null,{"$f":"IFERROR(VLOOKUP($C13,OFFSET(管理者用シート!$C$2,0,0,COUNTA(管理者用シート!E:E)-1,3),3,FALSE),\"\")","v":""},{"$f":"IFERROR(VLOOKUP(B13&C13,OFFSET(勤怠管理出勤!$E$3,0,0,COUNTA(勤怠管理出勤!F:F)-1,2),2,FALSE),\"\")","v":"00:00"},{"$f":"IFERROR(VLOOKUP(B13&C13,OFFSET(勤怠管理退勤!$E$3,0,0,COUNTA(勤怠管理退勤!F:F)-1,2),2,FALSE),\"\")","v":"00:00"},{"$f":"IFERROR(INDEX(OFFSET(業務日報!$D$3,0,0,COUNTA(業務日報!D:D)-2,1),MATCH(勤怠日報管理!B13&勤怠日報管理!C13,OFFSET(業務日報!$E$3,0,0,COUNTA(業務日報!E:E)-2,1),0)),\"\")","v":""}]
[null,"1月0日",null,{"$f":"IFERROR(VLOOKUP($C14,OFFSET(管理者用シート!$C$2,0,0,COUNTA(管理者用シート!E:E)-1,3),3,FALSE),\"\")","v":""},{"$f":"IFERROR(VLOOKUP(B14&C14,OFFSET(勤怠管理出勤!$E$3,0,0,COUNTA(勤怠管理出勤!F:F)-1,2),2,FALSE),\"\")","v":"00:00"},{"$f":"IFERROR(VLOOKUP(B14&C14,OFFSET(勤怠管理退勤!$E$3,0,0,COUNTA(勤怠管理退勤!F:F)-1,2),2,FALSE),\"\")","v":"00:00"},{"$f":"IFERROR(INDEX(OFFSET(業務日報!$D$3,0,0,COUNTA(業務日報!D:D)-2,1),MATCH(勤怠日報管理!B14&勤怠日報管理!C14,OFFSET(業務日報!$E$3,0,0,COUNTA(業務日報!E:E)-2,1),0)),\"\")","v":""}]
[null,"1月0日",null,{"$f":"IFERROR(VLOOKUP($C15,OFFSET(管理者用シート!$C$2,0,0,COUNTA(管理者用シート!E:E)-1,3),3,FALSE),\"\")","v":""},{"$f":"IFERROR(VLOOKUP(B15&C15,OFFSET(勤怠管理出勤!$E$3,0,0,COUNTA(勤怠管理出勤!F:F)-1,2),2,FALSE),\"\")","v":"00:00"},{"$f":"IFERROR(VLOOKUP(B15&C15,OFFSET(勤怠管理退勤!$E$3,0,0,COUNTA(勤怠管理退勤!F:F)-1,2),2,FALSE),\"\")","v":"00:00"},{"$f":"IFERROR(INDEX(OFFSET(業務日報!$D$3,0,0,COUNTA(業務日報!D:D)-2,1),MATCH(勤怠日報管理!B15&勤怠日報管理!C15,OFFSET(業務日報!$E$3,0,0,COUNTA(業務日報!E:E)-2,1),0)),\"\")","v":""}]
[null,"1月0日",null,{"$f":"IFERROR(VLOOKUP($C16,OFFSET(管理者用シート!$C$2,0,0,COUNTA(管理者用シート!E:E)-1,3),3,FALSE),\"\")","v":""},{"$f":"IFERROR(VLOOKUP(B16&C16,OFFSET(勤怠管理出勤!$E$3,0,0,COUNTA(勤怠管理出勤!F:F)-1,2),2,FALSE),\"\")","v":"00:00"},{"$f":"IFERROR(VLOOKUP(B16&C16,OFFSET(勤怠管理退勤!$E$3,0,0,COUNTA(勤怠管理退勤!F:F)-1,2),2,FALSE),\"\")","v":"00:00"},{"$f":"IFERROR(INDEX(OFFSET(業務日報!$D$3,0,0,COUNTA(業務日報!D:D)-2,1),MATCH(勤怠日報管理!B16&勤怠日報管理!C16,OFFSET(業務日報!$E$3,0,0,COUNTA(業務日報!E:E)-2,1),0)),\"\")","v":""}]
[null,"1月0日",null,{"$f":"IFERROR(VLOOKUP($C17,OFFSET(管理者用シート!$C$2,0,0,COUNTA(管理者用シート!E:E)-1,3),3,FALSE),\"\")","v":""},{"$f":"IFERROR(VLOOKUP(B17&C17,OFFSET(勤怠管理出勤!$E$3,0,0,COUNTA(勤怠管理出勤!F:F)-1,2),2,FALSE),\"\")","v":"00:00"},{"$f":"IFERROR(VLOOKUP(B17&C17,OFFSET(勤怠管理退勤!$E$3,0,0,COUNTA(勤怠管理退勤!F:F)-1,2),2,FALSE),\"\")","v":"00:00"},{"$f":"IFERROR(INDEX(OFFSET(業務日報!$D$3,0,0,COUNTA(業務日報!D:D)-2,1),MATCH(勤怠日報管理!B17&勤怠日報管理!C17,OFFSET(業務日報!$E$3,0,0,COUNTA(業務日報!E:E)-2,1),0)),\"\")","v":""}]
[null,"1月0日",null,{"$f":"IFERROR(VLOOKUP($C18,OFFSET(管理者用シート!$C$2,0,0,COUNTA(管理者用シート!E:E)-1,3),3,FALSE),\"\")","v":""},{"$f":"IFERROR(VLOOKUP(B18&C18,OFFSET(勤怠管理出勤!$E$3,0,0,COUNTA(勤怠管理出勤!F:F)-1,2),2,FALSE),\"\")","v":"00:00"},{"$f":"IFERROR(VLOOKUP(B18&C18,OFFSET(勤怠管理退勤!$E$3,0,0,COUNTA(勤怠管理退勤!F:F)-1,2),2,FALSE),\"\")","v":"00:00"},{"$f":"IFERROR(INDEX(OFFSET(業務日報!$D$3,0,0,COUNTA(業務日報!D:D)-2,1),MATCH(勤怠日報管理!B18&勤怠日報管理!C18,OFFSET(業務日報!$E$3,0,0,COUNTA(業務日報!E:E)-2,1),0)),\"\")","v":""}]
[null,"1月0日",null,{"$f":"IFERROR(VLOOKUP($C19,OFFSET(管理者用シート!$C$2,0,0,COUNTA(管理者用シート!E:E)-1,3),3,FALSE),\"\")","v":""},{"$f":"IFERROR(VLOOKUP(B19&C19,OFFSET(勤怠管理出勤!$E$3,0,0,COUNTA(勤怠管理出勤!F:F)-1,2),2,FALSE),\"\")","v":"00:00"},{"$f":"IFERROR(VLOOKUP(B19&C19,OFFSET(勤怠管理退勤!$E$3,0,0,COUNTA(勤怠管理退勤!F:F)-1,2),2,FALSE),\"\")","v":"00:00"},{"$f":"IFERROR(INDEX(OFFSET(業務日報!$D$3,0,0,COUNTA(業務日報!D:D)-2,1),MATCH(勤怠日報管理!B19&勤怠日報管理!C19,OFFSET(業務日報!$E$3,0,0,COUNTA(業務日報!E:E)-2,1),0)),\"\")","v":""}]
[null,"1月0日",null,{"$f":"IFERROR(VLOOKUP($C20,OFFSET(管理者用シート!$C$2,0,0,COUNTA(管理者用シート!E:E)-1,3),3,FALSE),\"\")","v":""},{"$f":"IFERROR(VLOOKUP(B20&C20,OFFSET(勤怠管理出勤!$E$3,0,0,COUNTA(勤怠管理出勤!F:F)-1,2),2,FALSE),\"\")","v":"00:00"},{"$f":"IFERROR(VLOOKUP(B20&C20,OFFSET(勤怠管理退勤!$E$3,0,0,COUNTA(勤怠管理退勤!F:F)-1,2),2,FALSE),\"\")","v":"00:00"},{"$f":"IFERROR(INDEX(OFFSET(業務日報!$D$3,0,0,COUNTA(業務日報!D:D)-2,1),MATCH(勤怠日報管理!B20&勤怠日報管理!C20,OFFSET(業務日報!$E$3,0,0,COUNTA(業務日報!E:E)-2,1),0)),\"\")","v":""}]
[null,"1月0日",null,{"$f":"IFERROR(VLOOKUP($C21,OFFSET(管理者用シート!$C$2,0,0,COUNTA(管理者用シート!E:E)-1,3),3,FALSE),\"\")","v":""},{"$f":"IFERROR(VLOOKUP(B21&C21,OFFSET(勤怠管理出勤!$E$3,0,0,COUNTA(勤怠管理出勤!F:F)-1,2),2,FALSE),\"\")","v":"00:00"},{"$f":"IFERROR(VLOOKUP(B21&C21,OFFSET(勤怠管理退勤!$E$3,0,0,COUNTA(勤怠管理退勤!F:F)-1,2),2,FALSE),\"\")","v":"00:00"},{"$f":"IFERROR(INDEX(OFFSET(業務日報!$D$3,0,0,COUNTA(業務日報!D:D)-2,1),MATCH(勤怠日報管理!B21&勤怠日報管理!C21,OFFSET(業務日報!$E$3,0,0,COUNTA(業務日報!E:E)-2,1),0)),\"\")","v":""}]
[null,"1月0日",null,{"$f":"IFERROR(VLOOKUP($C22,OFFSET(管理者用シート!$C$2,0,0,COUNTA(管理者用シート!E:E)-1,3),3,FALSE),\"\")","v":""},{"$f":"IFERROR(VLOOKUP(B22&C22,OFFSET(勤怠管理出勤!$E$3,0,0,COUNTA(勤怠管理出勤!F:F)-1,2),2,FALSE),\"\")","v":"00:00"},{"$f":"IFERROR(VLOOKUP(B22&C22,OFFSET(勤怠管理退勤!$E$3,0,0,COUNTA(勤怠管理退勤!F:F)-1,2),2,FALSE),\"\")","v":"00:00"},{"$f":"IFERROR(INDEX(OFFSET(業務日報!$D$3,0,0,COUNTA(業務日報!D:D)-2,1),MATCH(勤怠日報管理!B22&勤怠日報管理!C22,OFFSET(業務日報!$E$3,0,0,COUNTA(業務日報!E:E)-2,1),0)),\"\")","v":""}]
[null,"1月0日",null,{"$f":"IFERROR(VLOOKUP($C23,OFFSET(管理者用シート!$C$2,0,0,COUNTA(管理者用シート!E:E)-1,3),3,FALSE),\"\")","v":""},{"$f":"IFERROR(VLOOKUP(B23&C23,OFFSET(勤怠管理出勤!$E$3,0,0,COUNTA(勤怠管理出勤!F:F)-1,2),2,FALSE),\"\")","v":"00:00"},{"$f":"IFERROR(VLOOKUP(B23&C23,OFFSET(勤怠管理退勤!$E$3,0,0,COUNTA(勤怠管理退勤!F:F)-1,2),2,FALSE),\"\")","v":"00:00"},{"$f":"IFERROR(INDEX(OFFSET(業務日報!$D$3,0,0,COUNTA(業務日報!D:D)-2,1),MATCH(勤怠日報管理!B23&勤怠日報管理!C23,OFFSET(業務日報!$E$3,0,0,COUNTA(業務日報!E:E)-2,1),0)),\"\")","v":""}]
[null,"1月0日",null,{"$f":"IFERROR(VLOOKUP($C24,OFFSET(管理者用シート!$C$2,0,0,COUNTA(管理者用シート!E:E)-1,3),3,FALSE),\"\")","v":""},{"$f":"IFERROR(VLOOKUP(B24&C24,OFFSET(勤怠管理出勤!$E$3,0,0,COUNTA(勤怠管理出勤!F:F)-1,2),2,FALSE),\"\")","v":"00:00"},{"$f":"IFERROR(VLOOKUP(B24&C24,OFFSET(勤怠管理退勤!$E$3,0,0,COUNTA(勤怠管理退勤!F:F)-1,2),2,FALSE),\"\")","v":"00:00"},{"$f":"IFERROR(INDEX(OFFSET(業務日報!$D$3,0,0,COUNTA(業務日報!D:D)-2,1),MATCH(勤怠日報管理!B24&勤怠日報管理!C24,OFFSET(業務日報!$E$3,0,0,COUNTA(業務日報!E:E)-2,1),0)),\"\")","v":""}]
[null,"1月0日",null,{"$f":"IFERROR(VLOOKUP($C25,OFFSET(管理者用シート!$C$2,0,0,COUNTA(管理者用シート!E:E)-1,3),3,FALSE),\"\")","v":""},{"$f":"IFERROR(VLOOKUP(B25&C25,OFFSET(勤怠管理出勤!$E$3,0,0,COUNTA(勤怠管理出勤!F:F)-1,2),2,FALSE),\"\")","v":"00:00"},{"$f":"IFERROR(VLOOKUP(B25&C25,OFFSET(勤怠管理退勤!$E$3,0,0,COUNTA(勤怠管理退勤!F:F)-1,2),2,FALSE),\"\")","v":"00:00"},{"$f":"IFERROR(INDEX(OFFSET(業務日報!$D$3,0,0,COUNTA(業務日報!D:D)-2,1),MATCH(勤怠日報管理!B25&勤怠日報管理!C25,OFFSET(業務日報!$E$3,0,0,COUNTA(業務日報!E:E)-2,1),0)),\"\")","v":""}]
[null,"1月0日",null,{"$f":"IFERROR(VLOOKUP($C26,OFFSET(管理者用シート!$C$2,0,0,COUNTA(管理者用シート!E:E)-1,3),3,FALSE),\"\")","v":""},{"$f":"IFERROR(VLOOKUP(B26&C26,OFFSET(勤怠管理出勤!$E$3,0,0,COUNTA(勤怠管理出勤!F:F)-1,2),2,FALSE),\"\")","v":"00:00"},{"$f":"IFERROR(VLOOKUP(B26&C26,OFFSET(勤怠管理退勤!$E$3,0,0,COUNTA(勤怠管理退勤!F:F)-1,2),2,FALSE),\"\")","v":"00:00"},{"$f":"IFERROR(INDEX(OFFSET(業務日報!$D$3,0,0,COUNTA(業務日報!D:D)-2,1),MATCH(勤怠日報管理!B26&勤怠日報管理!C26,OFFSET(業務日報!$E$3,0,0,COUNTA(業務日報!E:E)-2,1),0)),\"\")","v":""}]
[null,"1月0日",null,{"$f":"IFERROR(VLOOKUP($C27,OFFSET(管理者用シート!$C$2,0,0,COUNTA(管理者用シート!E:E)-1,3),3,FALSE),\"\")","v":""},{"$f":"IFERROR(VLOOKUP(B27&C27,OFFSET(勤怠管理出勤!$E$3,0,0,COUNTA(勤怠管理出勤!F:F)-1,2),2,FALSE),\"\")","v":"00:00"},{"$f":"IFERROR(VLOOKUP(B27&C27,OFFSET(勤怠管理退勤!$E$3,0,0,COUNTA(勤怠管理退勤!F:F)-1,2),2,FALSE),\"\")","v":"00:00"},{"$f":"IFERROR(INDEX(OFFSET(業務日報!$D$3,0,0,COUNTA(業務日報!D:D)-2,1),MATCH(勤怠日報管理!B27&勤怠日報管理!C27,OFFSET(業務日報!$E$3,0,0,COUNTA(業務日報!E:E)-2,1),0)),\"\")","v":""}]
[null,"1月0日",null,{"$f":"IFERROR(VLOOKUP($C28,OFFSET(管理者用シート!$C$2,0,0,COUNTA(管理者用シート!E:E)-1,3),3,FALSE),\"\")","v":""},{"$f":"IFERROR(VLOOKUP(B28&C28,OFFSET(勤怠管理出勤!$E$3,0,0,COUNTA(勤怠管理出勤!F:F)-1,2),2,FALSE),\"\")","v":"00:00"},{"$f":"IFERROR(VLOOKUP(B28&C28,OFFSET(勤怠管理退勤!$E$3,0,0,COUNTA(勤怠管理退勤!F:F)-1,2),2,FALSE),\"\")","v":"00:00"},{"$f":"IFERROR(INDEX(OFFSET(業務日報!$D$3,0,0,COUNTA(業務日報!D:D)-2,1),MATCH(勤怠日報管理!B28&勤怠日報管理!C28,OFFSET(業務日報!$E$3,0,0,COUNTA(業務日報!E:E)-2,1),0)),\"\")","v":""}]
[null,"1月0日",null,{"$f":"IFERROR(VLOOKUP($C29,OFFSET(管理者用シート!$C$2,0,0,COUNTA(管理者用シート!E:E)-1,3),3,FALSE),\"\")","v":""},{"$f":"IFERROR(VLOOKUP(B29&C29,OFFSET(勤怠管理出勤!$E$3,0,0,COUNTA(勤怠管理出勤!F:F)-1,2),2,FALSE),\"\")","v":"00:00"},{"$f":"IFERROR(VLOOKUP(B29&C29,OFFSET(勤怠管理退勤!$E$3,0,0,COUNTA(勤怠管理退勤!F:F)-1,2),2,FALSE),\"\")","v":"00:00"},{"$f":"IFERROR(INDEX(OFFSET(業務日報!$D$3,0,0,COUNTA(業務日報!D:D)-2,1),MATCH(勤怠日報管理!B29&勤怠日報管理!C29,OFFSET(業務日報!$E$3,0,0,COUNTA(業務日報!E:E)-2,1),0)),\"\")","v":""}]
[null,"1月0日",null,{"$f":"IFERROR(VLOOKUP($C30,OFFSET(管理者用シート!$C$2,0,0,COUNTA(管理者用シート!E:E)-1,3),3,FALSE),\"\")","v":""},{"$f":"IFERROR(VLOOKUP(B30&C30,OFFSET(勤怠管理出勤!$E$3,0,0,COUNTA(勤怠管理出勤!F:F)-1,2),2,FALSE),\"\")","v":"00:00"},{"$f":"IFERROR(VLOOKUP(B30&C30,OFFSET(勤怠管理退勤!$E$3,0,0,COUNTA(勤怠管理退勤!F:F)-1,2),2,FALSE),\"\")","v":"00:00"},{"$f":"IFERROR(INDEX(OFFSET(業務日報!$D$3,0,0,COUNTA(業務日報!D:D)-2,1),MATCH(勤怠日報管理!B30&勤怠日報管理!C30,OFFSET(業務日報!$E$3,0,0,COUNTA(業務日報!E:E)-2,1),0)),\"\")","v":""}]
[null,"1月0日",null,{"$f":"IFERROR(VLOOKUP($C31,OFFSET(管理者用シート!$C$2,0,0,COUNTA(管理者用シート!E:E)-1,3),3,FALSE),\"\")","v":""},{"$f":"IFERROR(VLOOKUP(B31&C31,OFFSET(勤怠管理出勤!$E$3,0,0,COUNTA(勤怠管理出勤!F:F)-1,2),2,FALSE),\"\")","v":"00:00"},{"$f":"IFERROR(VLOOKUP(B31&C31,OFFSET(勤怠管理退勤!$E$3,0,0,COUNTA(勤怠管理退勤!F:F)-1,2),2,FALSE),\"\")","v":"00:00"},{"$f":"IFERROR(INDEX(OFFSET(業務日報!$D$3,0,0,COUNTA(業務日報!D:D)-2,1),MATCH(勤怠日報管理!B31&勤怠日報管理!C31,OFFSET(業務日報!$E$3,0,0,COUNTA(業務日報!E:E)-2,1),0)),\"\")","v":""}]
[null,"1月0日",null,{"$f":"IFERROR(VLOOKUP($C32,OFFSET(管理者用シート!$C$2,0,0,COUNTA(管理者用シート!E:E)-1,3),3,FALSE),\"\")","v":""},{"$f":"IFERROR(VLOOKUP(B32&C32,OFFSET(勤怠管理出勤!$E$3,0,0,COUNTA(勤怠管理出勤!F:F)-1,2),2,FALSE),\"\")","v":"00:00"},{"$f":"IFERROR(VLOOKUP(B32&C32,OFFSET(勤怠管理退勤!$E$3,0,0,COUNTA(勤怠管理退勤!F:F)-1,2),2,FALSE),\"\")","v":"00:00"},{"$f":"IFERROR(INDEX(OFFSET(業務日報!$D$3,0,0,COUNTA(業務日報!D:D)-2,1),MATCH(勤怠日報管理!B32&勤怠日報管理!C32,OFFSET(業務日報!$E$3,0,0,COUNTA(業務日報!E:E)-2,1),0)),\"\")","v":""}]
[null,"1月0日",null,{"$f":"IFERROR(VLOOKUP($C33,OFFSET(管理者用シート!$C$2,0,0,COUNTA(管理者用シート!E:E)-1,3),3,FALSE),\"\")","v":""},{"$f":"IFERROR(VLOOKUP(B33&C33,OFFSET(勤怠管理出勤!$E$3,0,0,COUNTA(勤怠管理出勤!F:F)-1,2),2,FALSE),\"\")","v":"00:00"},{"$f":"IFERROR(VLOOKUP(B33&C33,OFFSET(勤怠管理退勤!$E$3,0,0,COUNTA(勤怠管理退勤!F:F)-1,2),2,FALSE),\"\")","v":"00:00"},{"$f":"IFERROR(INDEX(OFFSET(業務日報!$D$3,0,0,COUNTA(業務日報!D:D)-2,1),MATCH(勤怠日報管理!B33&勤怠日報管理!C33,OFFSET(業務日報!$E$3,0,0,COUNTA(業務日報!E:E)-2,1),0)),\"\")","v":""}]
[null,"1月0日",null,{"$f":"IFERROR(VLOOKUP($C34,OFFSET(管理者用シート!$C$2,0,0,COUNTA(管理者用シート!E:E)-1,3),3,FALSE),\"\")","v":""},{"$f":"IFERROR(VLOOKUP(B34&C34,OFFSET(勤怠管理出勤!$E$3,0,0,COUNTA(勤怠管理出勤!F:F)-1,2),2,FALSE),\"\")","v":"00:00"},{"$f":"IFERROR(VLOOKUP(B34&C34,OFFSET(勤怠管理退勤!$E$3,0,0,COUNTA(勤怠管理退勤!F:F)-1,2),2,FALSE),\"\")","v":"00:00"},{"$f":"IFERROR(INDEX(OFFSET(業務日報!$D$3,0,0,COUNTA(業務日報!D:D)-2,1),MATCH(勤怠日報管理!B34&勤怠日報管理!C34,OFFSET(業務日報!$E$3,0,0,COUNTA(業務日報!E:E)-2,1),0)),\"\")","v":""}]
[null,"1月0日",null,{"$f":"IFERROR(VLOOKUP($C35,OFFSET(管理者用シート!$C$2,0,0,COUNTA(管理者用シート!E:E)-1,3),3,FALSE),\"\")","v":""},{"$f":"IFERROR(VLOOKUP(B35&C35,OFFSET(勤怠管理出勤!$E$3,0,0,COUNTA(勤怠管理出勤!F:F)-1,2),2,FALSE),\"\")","v":"00:00"},{"$f":"IFERROR(VLOOKUP(B35&C35,OFFSET(勤怠管理退勤!$E$3,0,0,COUNTA(勤怠管理退勤!F:F)-1,2),2,FALSE),\"\")","v":"00:00"},{"$f":"IFERROR(INDEX(OFFSET(業務日報!$D$3,0,0,COUNTA(業務日報!D:D)-2,1),MATCH(勤怠日報管理!B35&勤怠日報管理!C35,OFFSET(業務日報!$E$3,0,0,COUNTA(業務日報!E:E)-2,1),0)),\"\")","v":""}]
[null,"1月0日",null,{"$f":"IFERROR(VLOOKUP($C36,OFFSET(管理者用シート!$C$2,0,0,COUNTA(管理者用シート!E:E)-1,3),3,FALSE),\"\")","v":""},{"$f":"IFERROR(VLOOKUP(B36&C36,OFFSET(勤怠管理出勤!$E$3,0,0,COUNTA(勤怠管理出勤!F:F)-1,2),2,FALSE),\"\")","v":"00:00"},{"$f":"IFERROR(VLOOKUP(B36&C36,OFFSET(勤怠管理退勤!$E$3,0,0,COUNTA(勤怠管理退勤!F:F)-1,2),2,FALSE),\"\")","v":"00:00"},{"$f":"IFERROR(INDEX(OFFSET(業務日報!$D$3,0,0,COUNTA(業務日報!D:D)-2,1),MATCH(勤怠日報管理!B36&勤怠日報管理!C36,OFFSET(業務日報!$E$3,0,0,COUNTA(業務日報!E:E)-2,1),0)),\"\")","v":""}]
[null,"1月0日",null,{"$f":"IFERROR(VLOOKUP($C37,OFFSET(管理者用シート!$C$2,0,0,COUNTA(管理者用シート!E:E)-1,3),3,FALSE),\"\")","v":""},{"$f":"IFERROR(VLOOKUP(B37&C37,OFFSET(勤怠管理出勤!$E$3,0,0,COUNTA(勤怠管理出勤!F:F)-1,2),2,FALSE),\"\")","v":"00:00"},{"$f":"IFERROR(VLOOKUP(B37&C37,OFFSET(勤怠管理退勤!$E$3,0,0,COUNTA(勤怠管理退勤!F:F)-1,2),2,FALSE),\"\")","v":"00:00"},{"$f":"IFERROR(INDEX(OFFSET(業務日報!$D$3,0,0,COUNTA(業務日報!D:D)-2,1),MATCH(勤怠日報管理!B37&勤怠日報管理!C37,OFFSET(業務日報!$E$3,0,0,COUNTA(業務日報!E:E)-2,1),0)),\"\")","v":""}]
[null,"1月0日",null,{"$f":"IFERROR(VLOOKUP($C38,OFFSET(管理者用シート!$C$2,0,0,COUNTA(管理者用シート!E:E)-1,3),3,FALSE),\"\")","v":""},{"$f":"IFERROR(VLOOKUP(B38&C38,OFFSET(勤怠管理出勤!$E$3,0,0,COUNTA(勤怠管理出勤!F:F)-1,2),2,FALSE),\"\")","v":"00:00"},{"$f":"IFERROR(VLOOKUP(B38&C38,OFFSET(勤怠管理退勤!$E$3,0,0,COUNTA(勤怠管理退勤!F:F)-1,2),2,FALSE),\"\")","v":"00:00"},{"$f":"IFERROR(INDEX(OFFSET(業務日報!$D$3,0,0,COUNTA(業務日報!D:D)-2,1),MATCH(勤怠日報管理!B38&勤怠日報管理!C38,OFFSET(業務日報!$E$3,0,0,COUNTA(業務日報!E:E)-2,1),0)),\"\")","v":""}]
[null,"1月0日",null,{"$f":"IFERROR(VLOOKUP($C39,OFFSET(管理者用シート!$C$2,0,0,COUNTA(管理者用シート!E:E)-1,3),3,FALSE),\"\")","v":""},{"$f":"IFERROR(VLOOKUP(B39&C39,OFFSET(勤怠管理出勤!$E$3,0,0,COUNTA(勤怠管理出勤!F:F)-1,2),2,FALSE),\"\")","v":"00:00"},{"$f":"IFERROR(VLOOKUP(B39&C39,OFFSET(勤怠管理退勤!$E$3,0,0,COUNTA(勤怠管理退勤!F:F)-1,2),2,FALSE),\"\")","v":"00:00"},{"$f":"IFERROR(INDEX(OFFSET(業務日報!$D$3,0,0,COUNTA(業務日報!D:D)-2,1),MATCH(勤怠日報管理!B39&勤怠日報管理!C39,OFFSET(業務日報!$E$3,0,0,COUNTA(業務日報!E:E)-2,1),0)),\"\")","v":""}]
[null,"1月0日",null,{"$f":"IFERROR(VLOOKUP($C40,OFFSET(管理者用シート!$C$2,0,0,COUNTA(管理者用シート!E:E)-1,3),3,FALSE),\"\")","v":""},{"$f":"IFERROR(VLOOKUP(B40&C40,OFFSET(勤怠管理出勤!$E$3,0,0,COUNTA(勤怠管理出勤!F:F)-1,2),2,FALSE),\"\")","v":"00:00"},{"$f":"IFERROR(VLOOKUP(B40&C40,OFFSET(勤怠管理退勤!$E$3,0,0,COUNTA(勤怠管理退勤!F:F)-1,2),2,FALSE),\"\")","v":"00:00"},{"$f":"IFERROR(INDEX(OFFSET(業務日報!$D$3,0,0,COUNTA(業務日報!D:D)-2,1),MATCH(勤怠日報管理!B40&勤怠日報管理!C40,OFFSET(業務日報!$E$3,0,0,COUNTA(業務日報!E:E)-2,1),0)),\"\")","v":""}]
{"$rows_left_out":163}